Target
Bcl-2 homologous antagonist/killer
Ligand
BDBM50330250
Substrate
Meas. Tech.
ChEMBL_2201151 (CHEMBL5113859)
IC50
122000±n/a nM
Citation
 Negi, AMurphy, PV Development of Mcl-1 inhibitors for cancer therapy. Eur J Med Chem 210:0 (2021) Target
Name:
Bcl-2 homologous antagonist/killer
Synonyms:
Apoptosis regulator BAK BAK1 BCL2L7 Bcl-2-like protein 7 CDN1
Type:
PROTEIN
Mol. Mass.:
23406.37
Organism:
Homo sapiens
Description:
ChEMBL_117067
Residue:
211
  
Inhibitor
Name:
BDBM50330250
Synonyms:
5,5'-Dibenzyl-6,6',7,7'-tetrahydroxy-3,3'-dimethyl-2,2'-binaphthyl-1,1',4,4'-tetraone | CHEMBL1269107
Type:
Small organic molecule
Emp. Form.:
C36H26O8
Mol. Mass.:
586.5868
SMILES:
Oc1cc2c(O)c(-c3c(O)c4cc(O)c(O)c(=Cc5ccccc5)c4c(O)c3=C)c(=C)c(O)c2c(=Cc2ccccc2)c1O
: