Target
Bcl-2 homologous antagonist/killer
Ligand
BDBM50591665
Substrate
Meas. Tech.
ChEMBL_2201160 (CHEMBL5113868)
IC50
44000±n/a nM
Citation
 Negi, AMurphy, PV Development of Mcl-1 inhibitors for cancer therapy. Eur J Med Chem 210:0 (2021) Target
Name:
Bcl-2 homologous antagonist/killer
Synonyms:
Apoptosis regulator BAK BAK1 BCL2L7 Bcl-2-like protein 7 CDN1
Type:
PROTEIN
Mol. Mass.:
23406.37
Organism:
Homo sapiens
Description:
ChEMBL_117067
Residue:
211
  
Inhibitor
Name:
BDBM50591665
Synonyms:
CHEMBL5181238
Type:
Small organic molecule
Emp. Form.:
C20H14NO4
Mol. Mass.:
332.3289
SMILES:
C[n+]1cc2cc3OCOc3cc2c2ccc3cc4OCOc4cc3c12
: