Target
Bcl-2 homologous antagonist/killer
Ligand
BDBM50308110
Substrate
Meas. Tech.
ChEMBL_2201162 (CHEMBL5113870)
Ki
6900±n/a nM
Citation
 Negi, AMurphy, PV Development of Mcl-1 inhibitors for cancer therapy. Eur J Med Chem 210:0 (2021) Target
Name:
Bcl-2 homologous antagonist/killer
Synonyms:
Apoptosis regulator BAK BAK1 BCL2L7 Bcl-2-like protein 7 CDN1
Type:
PROTEIN
Mol. Mass.:
23406.37
Organism:
Homo sapiens
Description:
ChEMBL_117067
Residue:
211
  
Inhibitor
Name:
BDBM50308110
Synonyms:
(S,Z)-2-(5-((6-(2,3-dimethoxyphenyl)pyridin-3-yl)methylene)-4-oxo-2-thioxothiazolidin-3-yl)-3-phenylpropanoic acid | CHEMBL605114
Type:
Small organic molecule
Emp. Form.:
C26H22N2O5S2
Mol. Mass.:
506.593
SMILES:
COc1cccc(c1OC)-c1ccc(\C=C2/SC(=S)N([C@@H](Cc3ccccc3)C(O)=O)C2=O)cn1
: