Target
Bcl-2 homologous antagonist/killer
Ligand
BDBM50591666
Substrate
Meas. Tech.
ChEMBL_2201162 (CHEMBL5113870)
Ki
7770±n/a nM
Citation
 Negi, AMurphy, PV Development of Mcl-1 inhibitors for cancer therapy. Eur J Med Chem 210:0 (2021) Target
Name:
Bcl-2 homologous antagonist/killer
Synonyms:
Apoptosis regulator BAK BAK1 BCL2L7 Bcl-2-like protein 7 CDN1
Type:
PROTEIN
Mol. Mass.:
23406.37
Organism:
Homo sapiens
Description:
ChEMBL_117067
Residue:
211
  
Inhibitor
Name:
BDBM50591666
Synonyms:
CHEMBL5207001
Type:
Small organic molecule
Emp. Form.:
C21H24ClNO5S
Mol. Mass.:
437.937
SMILES:
Cc1cc(OCCCS(=O)(=O)N2CC(Cc3ccccc23)C(O)=O)cc(C)c1Cl
: