Target
Bcl-2 homologous antagonist/killer
Ligand
BDBM50591667
Substrate
Meas. Tech.
ChEMBL_2201162 (CHEMBL5113870)
Ki
261000±n/a nM
Citation
 Negi, AMurphy, PV Development of Mcl-1 inhibitors for cancer therapy. Eur J Med Chem 210:0 (2021) Target
Name:
Bcl-2 homologous antagonist/killer
Synonyms:
Apoptosis regulator BAK BAK1 BCL2L7 Bcl-2-like protein 7 CDN1
Type:
PROTEIN
Mol. Mass.:
23406.37
Organism:
Homo sapiens
Description:
ChEMBL_117067
Residue:
211
  
Inhibitor
Name:
BDBM50591667
Synonyms:
CHEMBL5170330
Type:
Small organic molecule
Emp. Form.:
C16H17NO4
Mol. Mass.:
287.3105
SMILES:
CC(C)COc1nc(Oc2ccccc2)ccc1C(O)=O
: