Target
Bcl-2 homologous antagonist/killer
Ligand
BDBM50303215
Substrate
Meas. Tech.
ChEMBL_2201162 (CHEMBL5113870)
Ki
2900±n/a nM
Citation
 Negi, AMurphy, PV Development of Mcl-1 inhibitors for cancer therapy. Eur J Med Chem 210:0 (2021) Target
Name:
Bcl-2 homologous antagonist/killer
Synonyms:
Apoptosis regulator BAK BAK1 BCL2L7 Bcl-2-like protein 7 CDN1
Type:
PROTEIN
Mol. Mass.:
23406.37
Organism:
Homo sapiens
Description:
ChEMBL_117067
Residue:
211
  
Inhibitor
Name:
BDBM50303215
Synonyms:
CHEMBL4167501
Type:
Small organic molecule
Emp. Form.:
C21H18ClNO4
Mol. Mass.:
383.825
SMILES:
Cc1cc(Oc2ccc(C(O)=O)c(OCc3ccccc3)n2)cc(C)c1Cl
: