Target
Bcl-2 homologous antagonist/killer
Ligand
BDBM50591668
Substrate
Meas. Tech.
ChEMBL_2201162 (CHEMBL5113870)
Ki
153±n/a nM
Citation
 Negi, AMurphy, PV Development of Mcl-1 inhibitors for cancer therapy. Eur J Med Chem 210:0 (2021) Target
Name:
Bcl-2 homologous antagonist/killer
Synonyms:
Apoptosis regulator BAK BAK1 BCL2L7 Bcl-2-like protein 7 CDN1
Type:
PROTEIN
Mol. Mass.:
23406.37
Organism:
Homo sapiens
Description:
ChEMBL_117067
Residue:
211
  
Inhibitor
Name:
BDBM50591668
Synonyms:
CHEMBL5198484
Type:
Small organic molecule
Emp. Form.:
C36H35NO7
Mol. Mass.:
593.6656
SMILES:
[H][C@]12C[C@H](CCOC(=O)c3ccc(Oc4cccnc4)cc3)C=C[C@]1([C@H](\C=C(/C)c1ccc(cc1)C(O)=O)C=C(C)C2)C(O)=O
: