Target
Bcl-2 homologous antagonist/killer
Ligand
BDBM50107130
Substrate
Meas. Tech.
ChEMBL_2201164 (CHEMBL5113872)
Kd
84000±n/a nM
Citation
 Negi, AMurphy, PV Development of Mcl-1 inhibitors for cancer therapy. Eur J Med Chem 210:0 (2021) Target
Name:
Bcl-2 homologous antagonist/killer
Synonyms:
Apoptosis regulator BAK BAK1 BCL2L7 Bcl-2-like protein 7 CDN1
Type:
PROTEIN
Mol. Mass.:
23406.37
Organism:
Homo sapiens
Description:
ChEMBL_117067
Residue:
211
  
Inhibitor
Name:
BDBM50107130
Synonyms:
(Z)-2-(5-(4-bromobenzylidene)-4-oxo-2-thioxothiazolidin-3-yl)-3-methylbutanoic acid CHEMBL335265
Type:
Small organic molecule
Emp. Form.:
C15H14BrNO3S2
Mol. Mass.:
400.311
SMILES:
CC(C)C(N1C(=S)S\C(=C/c2ccc(Br)cc2)C1=O)C(O)=O
: