Target
Bcl-2 homologous antagonist/killer
Ligand
BDBM50266958
Substrate
Meas. Tech.
ChEMBL_2201187 (CHEMBL5113895)
Ki
1790±n/a nM
Citation
 Negi, AMurphy, PV Development of Mcl-1 inhibitors for cancer therapy. Eur J Med Chem 210:0 (2021) Target
Name:
Bcl-2 homologous antagonist/killer
Synonyms:
Apoptosis regulator BAK BAK1 BCL2L7 Bcl-2-like protein 7 CDN1
Type:
PROTEIN
Mol. Mass.:
23406.37
Organism:
Homo sapiens
Description:
ChEMBL_117067
Residue:
211
  
Inhibitor
Name:
BDBM50266958
Synonyms:
CHEMBL4077940
Type:
Small organic molecule
Emp. Form.:
C29H34N4O7
Mol. Mass.:
550.6029
SMILES:
CC(C)Oc1cc(ccc1N)C(=O)Nc1ccc(nc1OC(C)C)C(=O)Nc1ccc(cc1OC(C)C)C(O)=O
: