Target
Sodium-dependent noradrenaline transporter
Ligand
BDBM50110577
Substrate
Meas. Tech.
ChEMBL_303505 (CHEMBL839977)
Ki
1352±n/a nM
Citation
 Huang, YBae, SAZhu, ZGuo, NRoth, BLLaruelle, M Fluorinated diaryl sulfides as serotonin transporter ligands: synthesis, structure-activity relationship study, and in vivo evaluation of fluorine-18-labeled compounds as PET imaging agents. J Med Chem 48:2559-70 (2005)  
Target
Name:
Sodium-dependent noradrenaline transporter
Synonyms:
Monoamine transporter NET Noradrenaline Transporter (NET) Norepinephrine transporter protein (NET) SLC6A2 Sodium-dependent noradrenaline transporter (NET) | Solute carrier family 6 member 2
Type:
Multi-pass membrane protein
Mol. Mass.:
69337.72
Organism:
Homo sapiens (Human)
Description:
P23975
Residue:
617
  
Inhibitor
Name:
BDBM50110577
Synonyms:
2-(2-((dimethylamino)methyl)phenylthio)-5-iodoaniline CHEMBL23034 | CHEMBL2314218
Type:
Small organic molecule
Emp. Form.:
C15H17IN2S
Mol. Mass.:
384.278
SMILES:
CN(C)Cc1ccccc1Sc1ccc(I)cc1N
: