Target
Sodium-dependent dopamine transporter
Ligand
BDBM50164472
Substrate
Meas. Tech.
ChEMBL_303387 (CHEMBL838598)
Ki
5296±n/a nM
Citation
 Huang, YBae, SAZhu, ZGuo, NRoth, BLLaruelle, M Fluorinated diaryl sulfides as serotonin transporter ligands: synthesis, structure-activity relationship study, and in vivo evaluation of fluorine-18-labeled compounds as PET imaging agents. J Med Chem 48:2559-70 (2005)  
Target
Name:
Sodium-dependent dopamine transporter
Synonyms:
DA transporter DAT1 Dopamine transporter protein (DAT) SC6A3_HUMAN Sodium-dependent dopamine transporter Solute carrier family 6 member 3
Type:
Multi-pass membrane protein
Mol. Mass.:
68497.11
Organism:
Homo sapiens (Human)
Description:
Q01959
Residue:
620
  
Inhibitor
Name:
BDBM50164472
Synonyms:
2-(2-Aminomethyl-phenylsulfanyl)-5-methyl-phenylamine | CHEMBL366170
Type:
Small organic molecule
Emp. Form.:
C14H16N2S
Mol. Mass.:
244.355
SMILES:
Cc1ccc(Sc2ccccc2CN)c(N)c1
: