Target
Sodium-dependent serotonin transporter
Ligand
BDBM50164470
Substrate
Meas. Tech.
ChEMBL_303436 (CHEMBL839605)
Ki
518±n/a nM
Citation
 Huang, YBae, SAZhu, ZGuo, NRoth, BLLaruelle, M Fluorinated diaryl sulfides as serotonin transporter ligands: synthesis, structure-activity relationship study, and in vivo evaluation of fluorine-18-labeled compounds as PET imaging agents. J Med Chem 48:2559-70 (2005)  
Target
Name:
Sodium-dependent serotonin transporter
Synonyms:
5-HT Transporter 5HTT SC6A4_HUMAN SLC6A4 Serotonin transporter (5HTT) Sodium-dependent serotonin transporter (SERT) | Solute carrier family 6 member 4
Type:
Multi-pass membrane protein
Mol. Mass.:
70322.51
Organism:
Homo sapiens (Human)
Description:
P31645
Residue:
630
  
Inhibitor
Name:
BDBM50164470
Synonyms:
2-{2-[(3-Fluoro-propylamino)-methyl]-phenylsulfanyl}-5-methyl-phenylamine | CHEMBL195585
Type:
Small organic molecule
Emp. Form.:
C17H21FN2S
Mol. Mass.:
304.425
SMILES:
Cc1ccc(Sc2ccccc2CNCCCF)c(N)c1
: