Target
Sodium-dependent serotonin transporter
Ligand
BDBM50164474
Substrate
Meas. Tech.
ChEMBL_303436 (CHEMBL839605)
Ki
71.3±n/a nM
Citation
 Huang, YBae, SAZhu, ZGuo, NRoth, BLLaruelle, M Fluorinated diaryl sulfides as serotonin transporter ligands: synthesis, structure-activity relationship study, and in vivo evaluation of fluorine-18-labeled compounds as PET imaging agents. J Med Chem 48:2559-70 (2005)  
Target
Name:
Sodium-dependent serotonin transporter
Synonyms:
5-HT Transporter 5HTT SC6A4_HUMAN SLC6A4 Serotonin transporter (5HTT) Sodium-dependent serotonin transporter (SERT) | Solute carrier family 6 member 4
Type:
Multi-pass membrane protein
Mol. Mass.:
70322.51
Organism:
Homo sapiens (Human)
Description:
P31645
Residue:
630
  
Inhibitor
Name:
BDBM50164474
Synonyms:
2-{2-[(2-Fluoro-ethylamino)-methyl]-phenylsulfanyl}-5-methyl-phenylamine | CHEMBL192528
Type:
Small organic molecule
Emp. Form.:
C16H19FN2S
Mol. Mass.:
290.399
SMILES:
Cc1ccc(Sc2ccccc2CNCCF)c(N)c1
: