Target
Sodium-dependent dopamine transporter
Ligand
BDBM50164474
Substrate
Meas. Tech.
ChEMBL_303387 (CHEMBL838598)
Ki
4426±n/a nM
Citation
 Huang, YBae, SAZhu, ZGuo, NRoth, BLLaruelle, M Fluorinated diaryl sulfides as serotonin transporter ligands: synthesis, structure-activity relationship study, and in vivo evaluation of fluorine-18-labeled compounds as PET imaging agents. J Med Chem 48:2559-70 (2005)  
Target
Name:
Sodium-dependent dopamine transporter
Synonyms:
DA transporter DAT1 Dopamine transporter protein (DAT) SC6A3_HUMAN Sodium-dependent dopamine transporter Solute carrier family 6 member 3
Type:
Multi-pass membrane protein
Mol. Mass.:
68497.11
Organism:
Homo sapiens (Human)
Description:
Q01959
Residue:
620
  
Inhibitor
Name:
BDBM50164474
Synonyms:
2-{2-[(2-Fluoro-ethylamino)-methyl]-phenylsulfanyl}-5-methyl-phenylamine | CHEMBL192528
Type:
Small organic molecule
Emp. Form.:
C16H19FN2S
Mol. Mass.:
290.399
SMILES:
Cc1ccc(Sc2ccccc2CNCCF)c(N)c1
: