Target
Procathepsin L
Ligand
BDBM50229129
Substrate
Meas. Tech.
ChEMBL_2203194 (CHEMBL5115902)
Ki
10.0±n/a nM
Citation
 Jung, SFuchs, NGrathwol, CHellmich, UAWagner, ADiehl, EWillmes, TSotriffer, CSchirmeister, T New peptidomimetic rhodesain inhibitors with improved selectivity towards human cathepsins. Eur J Med Chem 238:0 (2022) Target
Name:
Procathepsin L
Synonyms:
CATL1_HUMAN CTSL CTSL1 Cathepsin L Cathepsin L1 heavy chain MEP cathepsin L preproprotein
Type:
Enzyme
Mol. Mass.:
37557.19
Organism:
Homo sapiens (Human)
Description:
Purchased from Calbiochem (San Diego, CA).
Residue:
333
  
Inhibitor
Name:
BDBM50229129
Synonyms:
4-Methyl-piperazine-1-carboxylic acid [(S)-1-((E)-(S)-3-benzenesulfonyl-1-phenethyl-allylcarbamoyl)-2-phenyl-ethyl]-amide 4-methyl-N-((S)-1-oxo-3-phenyl-1-((S)-5-phenyl-1-(phenylsulfonyl)pent-1-en-3-ylamino)propan-2-yl)piperazine-1-carboxamide CHEMBL91704 | K-777
Type:
Small organic molecule
Emp. Form.:
C32H38N4O4S
Mol. Mass.:
574.734
SMILES:
CN1CCN(CC1)C(=O)N[C@@H](Cc1ccccc1)C(=O)N[C@@H](CCc1ccccc1)C=CS(=O)(=O)c1ccccc1
: