Target
Gamma-aminobutyric acid receptor subunit alpha-2/beta-2/gamma-2
Ligand
BDBM50165325
Substrate
Meas. Tech.
ChEMBL_303743 (CHEMBL829786)
Ki
14.3±n/a nM
Citation
 Primofiore, GDa Settimo, FTaliani, SSalerno, SNovellino, EGreco, GCosimelli, BBesnard, FCosta, BMontali, MMartini, C High affinity central benzodiazepine receptor ligands: synthesis and biological evaluation of a series of phenyltriazolobenzotriazindione derivatives. J Med Chem 48:2936-43 (2005)  
Target
Name:
Gamma-aminobutyric acid receptor subunit alpha-2/beta-2/gamma-2
Synonyms:
GABA receptor alpha-2/beta-2/gamma-2 subunit
Type:
Mol. Mass.:
Description:
ASSAY_ID of EBI is 37810
Components:
This complex has 3 components.
Component 1
Name:
Gamma-aminobutyric acid receptor subunit beta-2
Synonyms:
GBRB2_RAT Gabrb2 | Gamma-aminobutyric acid receptor subunit beta-2 (GABA(A) beta-2)
Type:
Enzyme
Mol. Mass.:
54648.97
Organism:
Rattus norvegicus (Rat)
Description:
P63138
Residue:
474
  
Component 2
Name:
Gamma-aminobutyric acid receptor subunit gamma-2
Synonyms:
GBRG2_RAT Gamma-aminobutyric acid receptor subunit gamma-2 (GABA(A) gamma-2)
Type:
Enzyme
Mol. Mass.:
54087.63
Organism:
Rattus norvegicus (Rat)
Description:
P18508
Residue:
466
  
Component 3
Name:
Gamma-aminobutyric acid receptor subunit alpha-2
Synonyms:
GABA A Alpha2Beta2Gamma2 GABA A receptor alpha-2/beta-2/gamma-2 GABA(A) receptor subunit alpha-2 Gabra-2 Gamma-aminobutyric acid receptor subunit alpha-2
Type:
Enzyme
Mol. Mass.:
51195.57
Organism:
Rattus norvegicus (Rat)
Description:
P23576
Residue:
451
  
Inhibitor
Name:
BDBM50165325
Synonyms:
2-(4-Methoxy-phenyl)-5H-3,3a,5,9b-tetraaza-cyclopenta[a]naphthalene-1,4-dione | CHEMBL192554
Type:
Small organic molecule
Emp. Form.:
C16H12N4O3
Mol. Mass.:
308.2915
SMILES:
COc1ccc(cc1)-c1nn2n(c3ccccc3[nH]c2=O)c1=O
: