Target
Ephrin type-A receptor 1
Ligand
BDBM50592745
Substrate
Meas. Tech.
ChEMBL_2205236 (CHEMBL5117944)
IC50
292±n/a nM
Citation
 Guo, YGao, BGao, PFang, LGou, S Novel anilinopyrimidine derivatives as potential EGFR Bioorg Med Chem 70:0 (2022) Target
Name:
Ephrin type-A receptor 1
Synonyms:
EPH EPH tyrosine kinase 1 EPHA1_HUMAN EPHT1 Ephrin type-A receptor 1 Erythropoietin-producing hepatoma receptor hEpha1
Type:
Enzyme
Mol. Mass.:
108128.04
Organism:
Homo sapiens (Human)
Description:
P21709
Residue:
976
  
Inhibitor
Name:
BDBM50592745
Synonyms:
CHEMBL5188373
Type:
Small organic molecule
Emp. Form.:
C32H42BrN6O5P
Mol. Mass.:
701.591
SMILES:
COCC1CN(C1)C1CCN(CC1)c1cc(OC)c(Nc2ncc(Br)c(Nc3ccc4OCCOc4c3P(C)(C)=O)n2)cc1C
: