Target
5-hydroxytryptamine receptor 6
Ligand
BDBM50130285
Substrate
Meas. Tech.
ChEMBL_2205602 (CHEMBL5118310)
Ki
0.260000±n/a nM
Citation
 Yi, CXue, YChen, KWang, TYu, JWang, ZJin, C Novel difluoromethyl-containing 1-((4-methoxy-3-(piperazin-1-yl)phenyl)sulfonyl)-1H-indole scaffold as potent 5-HT Bioorg Med Chem 70:0 (2022) Target
Name:
5-hydroxytryptamine receptor 6
Synonyms:
5-HT-6 5-hydroxytryptamine receptor 6 (5-HT-6) 5-hydroxytryptamine receptor 6 (5HT6) HTR6 Serotonin 6 (5-HT6) receptor | Serotonin Receptor 6
Type:
G Protein-Coupled Receptor (GPCR)
Mol. Mass.:
46968.43
Organism:
Homo sapiens (Human)
Description:
P50406
Residue:
440
  
Inhibitor
Name:
BDBM50130285
Synonyms:
6-Bromo-1-(4-methoxy-3-piperazin-1-yl-benzenesulfonyl)-1H-indole | CHEMBL96745
Type:
Small organic molecule
Emp. Form.:
C19H20BrN3O3S
Mol. Mass.:
450.349
SMILES:
COc1ccc(cc1N1CCNCC1)S(=O)(=O)n1ccc2ccc(Br)cc12
: