Target
5-hydroxytryptamine receptor 6
Ligand
BDBM328409
Substrate
Meas. Tech.
ChEMBL_2205602 (CHEMBL5118310)
Ki
0.670000±n/a nM
Citation
 Yi, CXue, YChen, KWang, TYu, JWang, ZJin, C Novel difluoromethyl-containing 1-((4-methoxy-3-(piperazin-1-yl)phenyl)sulfonyl)-1H-indole scaffold as potent 5-HT Bioorg Med Chem 70:0 (2022) Target
Name:
5-hydroxytryptamine receptor 6
Synonyms:
5-HT-6 5-hydroxytryptamine receptor 6 (5-HT-6) 5-hydroxytryptamine receptor 6 (5HT6) HTR6 Serotonin 6 (5-HT6) receptor | Serotonin Receptor 6
Type:
G Protein-Coupled Receptor (GPCR)
Mol. Mass.:
46968.43
Organism:
Homo sapiens (Human)
Description:
P50406
Residue:
440
  
Inhibitor
Name:
BDBM328409
Synonyms:
5-chloro-1-((4-methoxy-3-(piperazin-1-yl)phenyl)sulfonyl)-3-methyl-1H-indole | US9663498, Example 60
Type:
Small organic molecule
Emp. Form.:
C20H22ClN3O3S
Mol. Mass.:
419.925
SMILES:
COc1ccc(cc1N1CCNCC1)S(=O)(=O)n1cc(C)c2cc(Cl)ccc12
: