Target
Matrix metalloproteinase-26
Ligand
BDBM50137278
Substrate
Meas. Tech.
ChEMBL_2206314 (CHEMBL5119022)
IC50
7903±n/a nM
Citation
 Baidya, SKBanerjee, SAdhikari, NJha, T Selective Inhibitors of Medium-Size S1' Pocket Matrix Metalloproteinases: A Stepping Stone of Future Drug Discovery. J Med Chem 65:10709-10754 (2022) Target
Name:
Matrix metalloproteinase-26
Synonyms:
Endometase MMP26 Matrilysin-2 Matrix metalloproteinase-26
Type:
PROTEIN
Mol. Mass.:
29707.55
Organism:
Homo sapiens (Human)
Description:
ChEMBL_806653
Residue:
261
  
Inhibitor
Name:
BDBM50137278
Synonyms:
2-(2,5-Dichloro-benzenesulfonyl)-6-hydroxy-1,2,3,4-tetrahydro-isoquinoline-1-carboxylic acid hydroxyamide CHEMBL424130
Type:
Small organic molecule
Emp. Form.:
C16H14Cl2N2O5S
Mol. Mass.:
417.264
SMILES:
ONC(=O)C1N(CCc2cc(O)ccc12)S(=O)(=O)c1cc(Cl)ccc1Cl
: