Target
D(3) dopamine receptor
Ligand
BDBM50166019
Substrate
Meas. Tech.
ChEMBL_303136 (CHEMBL829064)
Ki
19±n/a nM
Citation
 Ding, KChen, JJi, MWu, XVarady, JYang, CYLu, YDeschamps, JRLevant, BWang, S Enantiomerically pure hexahydropyrazinoquinolines as potent and selective dopamine 3 subtype receptor ligands. J Med Chem 48:3171-81 (2005)  
Target
Name:
D(3) dopamine receptor
Synonyms:
DOPAMINE D3 Dopamine D3 receptor | Drd3
Type:
Protein
Mol. Mass.:
49540.58
Organism:
Rattus norvegicus (Rat)
Description:
P19020
Residue:
446
  
Inhibitor
Name:
BDBM50166019
Synonyms:
CHEMBL191815 | Naphthalene-2-carboxylic acid [(R)-4-(1,2,4,4a,5,6-hexahydro-pyrazino[1,2-a]quinolin-3-yl)-butyl]-amide
Type:
Small organic molecule
Emp. Form.:
C27H31N3O
Mol. Mass.:
413.5545
SMILES:
O=C(NCCCCN1CCN2[C@H](CCc3ccccc23)C1)c1ccc2ccccc2c1
: