Target
D(1B) dopamine receptor
Ligand
BDBM50119380
Substrate
Meas. Tech.
ChEMBL_302994 (CHEMBL830233)
Ki
636±n/a nM
Citation
 Ding, KChen, JJi, MWu, XVarady, JYang, CYLu, YDeschamps, JRLevant, BWang, S Enantiomerically pure hexahydropyrazinoquinolines as potent and selective dopamine 3 subtype receptor ligands. J Med Chem 48:3171-81 (2005)  
Target
Name:
D(1B) dopamine receptor
Synonyms:
D(1B) dopamine receptor DRD5_RAT Dopamine D5 receptor Drd5
Type:
Enzyme Catalytic Domain
Mol. Mass.:
52827.88
Organism:
RAT
Description:
Dopamine D1B 0 RAT::P25115
Residue:
475
  
Inhibitor
Name:
BDBM50119380
Synonyms:
CHEMBL25236 N-(4-(4-(2-methoxyphenyl)piperazin-1-yl)butyl)-2-naphthamide | Naphthalene-2-carboxylic acid {4-[4-(2-methoxy-phenyl)-piperazin-1-yl]-butyl}-amide
Type:
Small organic molecule
Emp. Form.:
C26H31N3O2
Mol. Mass.:
417.5432
SMILES:
COc1ccccc1N1CCN(CCCCNC(=O)c2ccc3ccccc3c2)CC1
: