Target
D(4) dopamine receptor
Ligand
BDBM50133928
Substrate
Meas. Tech.
ChEMBL_303360 (CHEMBL838695)
Ki
243±n/a nM
Citation
 Ding, KChen, JJi, MWu, XVarady, JYang, CYLu, YDeschamps, JRLevant, BWang, S Enantiomerically pure hexahydropyrazinoquinolines as potent and selective dopamine 3 subtype receptor ligands. J Med Chem 48:3171-81 (2005)  
Target
Name:
D(4) dopamine receptor
Synonyms:
D(4) dopamine receptor DOPAMINE D4.4 Dopamine receptor | Drd4
Type:
Enzyme Catalytic Domain
Mol. Mass.:
41307.65
Organism:
RAT
Description:
DOPAMINE D4.4 0 RAT::P30729
Residue:
387
  
Inhibitor
Name:
BDBM50133928
Synonyms:
1-(4-Fluoro-phenyl)-4-(1,2,4,4a,5,6-hexahydro-pyrazino[1,2-a]quinolin-3-yl)-butan-1-one | CHEMBL341774
Type:
Small organic molecule
Emp. Form.:
C22H25FN2O
Mol. Mass.:
352.4451
SMILES:
Fc1ccc(cc1)C(=O)CCCN1CCN2C(CCc3ccccc23)C1
: