Target
D(3) dopamine receptor
Ligand
BDBM50119380
Substrate
Meas. Tech.
ChEMBL_303136 (CHEMBL829064)
Ki
1.1±n/a nM
Citation
 Ding, KChen, JJi, MWu, XVarady, JYang, CYLu, YDeschamps, JRLevant, BWang, S Enantiomerically pure hexahydropyrazinoquinolines as potent and selective dopamine 3 subtype receptor ligands. J Med Chem 48:3171-81 (2005)  
Target
Name:
D(3) dopamine receptor
Synonyms:
DOPAMINE D3 Dopamine D3 receptor | Drd3
Type:
Protein
Mol. Mass.:
49540.58
Organism:
Rattus norvegicus (Rat)
Description:
P19020
Residue:
446
  
Inhibitor
Name:
BDBM50119380
Synonyms:
CHEMBL25236 N-(4-(4-(2-methoxyphenyl)piperazin-1-yl)butyl)-2-naphthamide | Naphthalene-2-carboxylic acid {4-[4-(2-methoxy-phenyl)-piperazin-1-yl]-butyl}-amide
Type:
Small organic molecule
Emp. Form.:
C26H31N3O2
Mol. Mass.:
417.5432
SMILES:
COc1ccccc1N1CCN(CCCCNC(=O)c2ccc3ccccc3c2)CC1
: