Target
D(4) dopamine receptor
Ligand
BDBM50166032
Substrate
Meas. Tech.
ChEMBL_303360 (CHEMBL838695)
Ki
>10000±n/a nM
Citation
 Ding, KChen, JJi, MWu, XVarady, JYang, CYLu, YDeschamps, JRLevant, BWang, S Enantiomerically pure hexahydropyrazinoquinolines as potent and selective dopamine 3 subtype receptor ligands. J Med Chem 48:3171-81 (2005)  
Target
Name:
D(4) dopamine receptor
Synonyms:
D(4) dopamine receptor DOPAMINE D4.4 Dopamine receptor | Drd4
Type:
Enzyme Catalytic Domain
Mol. Mass.:
41307.65
Organism:
RAT
Description:
DOPAMINE D4.4 0 RAT::P30729
Residue:
387
  
Inhibitor
Name:
BDBM50166032
Synonyms:
CHEMBL191894 | Naphthalene-2-carboxylic acid {4-[2-((S)-8-methoxy-1,2,4,4a,5,6-hexahydro-pyrazino[1,2-a]quinolin-3-yl)-ethyl]-cyclohexyl}-amide
Type:
Small organic molecule
Emp. Form.:
C32H39N3O2
Mol. Mass.:
497.671
SMILES:
COc1ccc2N3CCN(CCC4CCC(CC4)NC(=O)c4ccc5ccccc5c4)C[C@@H]3CCc2c1
: