Target
Cytochrome P450 2D6
Ligand
BDBM50166613
Substrate
Meas. Tech.
ChEMBL_306014 (CHEMBL874551)
IC50
7888±n/a nM
Citation
 Le Bourdonnec, BAjello, CWSeida, PRSusnow, RGCassel, JABelanger, SStabley, GJDeHaven, RNDeHaven-Hudkins, DLDolle, RE Arylacetamide kappa opioid receptor agonists with reduced cytochrome P450 2D6 inhibitory activity. Bioorg Med Chem Lett 15:2647-52 (2005)  
Target
Name:
Cytochrome P450 2D6
Synonyms:
CP2D6_HUMAN CYP2DL1 Cytochrome P450 2D6 (CYP2D6) P450-DB1
Type:
Protein
Mol. Mass.:
55774.82
Organism:
Homo sapiens (Human)
Description:
P10635
Residue:
497
  
Inhibitor
Name:
BDBM50166613
Synonyms:
2-{4-[(Butane-1-sulfonylamino)-methyl]-phenyl}-N-[(S)-2-((S)-3-hydroxy-pyrrolidin-1-yl)-1-phenyl-ethyl]-N-methyl-acetamide | CHEMBL362741
Type:
Small organic molecule
Emp. Form.:
C26H37N3O4S
Mol. Mass.:
487.655
SMILES:
CCCCS(=O)(=O)NCc1ccc(CC(=O)N(C)[C@H](CN2CC[C@H](O)C2)c2ccccc2)cc1
: