Target
Protein mono-ADP-ribosyltransferase PARP15
Ligand
BDBM50594001
Substrate
Meas. Tech.
ChEMBL_2210612 (CHEMBL5123561)
IC50
589±n/a nM
Citation
 Nizi, MGMaksimainen, MMMurthy, SMassari, SAlaviuhkola, JLippok, BESowa, STGalera-Prat, APrunskaite-Hyyryläinen, RLüscher, BKorn, PLehtiö, LTabarrini, O Potent 2,3-dihydrophthalazine-1,4-dione derivatives as dual inhibitors for mono-ADP-ribosyltransferases PARP10 and PARP15. Eur J Med Chem 237:0 (2022) Target
Name:
Protein mono-ADP-ribosyltransferase PARP15
Synonyms:
(ARTD7 or PARP15) 2.4.2.- ADP-ribosyltransferase diphtheria toxin-like 7 B-aggressive lymphoma protein 3 Human diphtheria toxin-like ADP-ribosyltransferase (ARTD7 or PARP15, Y598L) PARP-15 Poly [ADP-ribose] polymerase 15 | Synonyms=BAL3
Type:
Mol. Mass.:
74595.89
Organism:
Homo sapiens (Human)
Description:
Q460N3
Residue:
678
  
Inhibitor
Name:
BDBM50594001
Synonyms:
CHEMBL5186481
Type:
Small organic molecule
Emp. Form.:
C14H11BrFNO2
Mol. Mass.:
324.145
SMILES:
NC(=O)c1ccc(OCc2cccc(Br)c2)cc1F
: