Target
Alpha-2C adrenergic receptor
Ligand
BDBM50167575
Substrate
Meas. Tech.
ChEMBL_303771 (CHEMBL829301)
Ki
32±n/a nM
Citation
 Mustafa, SMBavadekar, SAMa, GMoore, BMFeller, DRMiller, DD Synthesis and biological studies of yohimbine derivatives on human alpha2C-adrenergic receptors. Bioorg Med Chem Lett 15:2758-60 (2005)  
Target
Name:
Alpha-2C adrenergic receptor
Synonyms:
ADA2C_HUMAN ADRA2L2 Adrenergic alpha2C Adrenergic receptor alpha Alpha-2 adrenergic receptor subtype C4 Alpha-2C adrenoreceptor | adrenergic, alpha-2C-, receptor [Homo sapiens]
Type:
Enzyme
Mol. Mass.:
49552.32
Organism:
Homo sapiens (Human)
Description:
P18825
Residue:
462
  
Inhibitor
Name:
BDBM50167575
Synonyms:
(1R,2S,4aR,13bS)-2-Hydroxy-1,2,3,4,4a,5,7,8,13,13b,14,14a-dodecahydro-indolo[2',3':3,4]pyrido[1,2-b]isoquinoline-1-carboxylic acid (3-amino-propyl)-amide | CHEMBL196344
Type:
Small organic molecule
Emp. Form.:
C23H32N4O2
Mol. Mass.:
396.5258
SMILES:
NCCCNC(=O)[C@H]1[C@@H](O)CC[C@H]2CN3CCc4c([nH]c5ccccc45)[C@@H]3CC12
: