Target
5-hydroxytryptamine receptor 2A
Ligand
BDBM50167768
Substrate
Meas. Tech.
ChEMBL_303449 (CHEMBL839709)
Ki
3±n/a nM
Citation
 Bartolomé, JMAlcudia, AAndrés, JICid, JMGarcía, MMegens, AToledo, MATrabanco, AA Novel 2-N,N-dimethylaminomethyl-2,3,3a,12b-tetrahydrodibenzo[b,f]furo[2,3-d]oxepin derivatives displaying combined norepinephrine reuptake inhibition and 5-HT2A/2C receptor antagonism. Bioorg Med Chem Lett 15:2898-901 (2005)  
Target
Name:
5-hydroxytryptamine receptor 2A
Synonyms:
5-HT-2 5-HT2A 5-hydroxytryptamine receptor 2A (5HT-2A) 5HT2A_HUMAN HTR2A | Serotonin receptor 2A
Type:
undefined
Mol. Mass.:
52607.65
Organism:
Homo sapiens (Human)
Description:
P28223
Residue:
471
  
Inhibitor
Name:
BDBM50167768
Synonyms:
((2S,3aS,12bS)-11-Bromo-2,3,3a,12b-tetrahydro-1,8-dioxa-dibenzo[e,h]azulen-2-ylmethyl)-dimethyl-amine | CHEMBL365101
Type:
Small organic molecule
Emp. Form.:
C19H20BrNO2
Mol. Mass.:
374.272
SMILES:
CN(C)C[C@@H]1C[C@@H]2[C@H](O1)c1cc(Br)ccc1Oc1ccccc21
: