Target
Histone-lysine N-methyltransferase 2A
Ligand
BDBM50594520
Substrate
Meas. Tech.
ChEMBL_2213457 (CHEMBL5126406)
IC50
7100±n/a nM
Citation
 Kalmode, HPPodsiadly, IKabra, ABoulton, AReddy, PGao, YLi, CBushweller, JH Small-Molecule Inhibitors of the MLL1 CXXC Domain, an Epigenetic Reader of DNA Methylation. ACS Med Chem Lett 13:1363-1369 (2022) Target
Name:
Histone-lysine N-methyltransferase 2A
Synonyms:
ALL-1 ALL1 CXXC-type zinc finger protein 7 HRX Histone-lysine N-methyltransferase 2A KMT2A_HUMAN MLL MLL cleavage product N320 Myeloid/lymphoid or mixed-lineage leukemia Myeloid/lymphoid or mixed-lineage leukemia protein 1 TRX1 Zinc finger protein HRX p320
Type:
Protein
Mol. Mass.:
431905.67
Organism:
Homo sapiens (Human)
Description:
Q03164
Residue:
3969
  
Inhibitor
Name:
BDBM50594520
Synonyms:
CHEMBL5194845
Type:
Small organic molecule
Emp. Form.:
C15H17NO3
Mol. Mass.:
259.3004
SMILES:
OC(=O)C1(CCN(CC1)C(=O)C=C)c1ccccc1
: