Target
Histone acetyltransferase p300
Ligand
BDBM50346552
Substrate
Meas. Tech.
ChEMBL_2213576 (CHEMBL5126708)
Ki
400±n/a nM
Citation
 Wang, LBharti, naKumar, RPavlov, PFWinblad, B Small molecule therapeutics for tauopathy in Alzheimer's disease: Walking on the path of most resistance. Eur J Med Chem 209:0 (2021) Target
Name:
Histone acetyltransferase p300
Synonyms:
EP300 HIF1A/p300/CREB-binding protein P300
Type:
Protein
Mol. Mass.:
264223.04
Organism:
Homo sapiens (Human)
Description:
Q09472
Residue:
2414
  
Inhibitor
Name:
BDBM50346552
Synonyms:
CHEMBL1797936
Type:
Small organic molecule
Emp. Form.:
C24H19N3O6
Mol. Mass.:
445.4242
SMILES:
Cc1cc(-c2ccc(C=c3c(=C)[nH]n(-c4ccc(cc4)C(O)=O)c3=O)o2)c(cc1C)[N+]([O-])=O
: