Target
Adenosine receptor A2a
Ligand
BDBM50211078
Substrate
Meas. Tech.
ChEMBL_2213695 (CHEMBL5126827)
IC50
8.3±n/a nM
Citation
 Saini, APatel, RGaba, SSingh, GGupta, GDMonga, V Adenosine receptor antagonists: Recent advances and therapeutic perspective. Eur J Med Chem 227:0 (2022) Target
Name:
Adenosine receptor A2a
Synonyms:
A2A adenosine receptor (hA2A) ADENOSINE A2 ADORA2 Adenosine A2A receptor (A2AAR)
Type:
G Protein-Coupled Receptor (GPCR)
Mol. Mass.:
44716.46
Organism:
Homo sapiens (Human)
Description:
P29274
Residue:
412
  
Inhibitor
Name:
BDBM50211078
Synonyms:
CHEMBL3904408
Type:
Small organic molecule
Emp. Form.:
C17H15N5O2S
Mol. Mass.:
353.398
SMILES:
COc1cccc(CNc2nc(N)c3nc(sc3n2)-c2ccco2)c1
: