Target
Coagulation factor X
Ligand
BDBM50594756
Substrate
Meas. Tech.
ChEMBL_2214181 (CHEMBL5127313)
IC50
0.500000±n/a nM
Citation
 Li, XGuo, TFeng, QBai, TWu, LLiu, YZheng, XJia, JPei, JWu, SSong, YZhang, Y Progress of thrombus formation and research on the structure-activity relationship for antithrombotic drugs. Eur J Med Chem 228:0 (2022) Target
Name:
Coagulation factor X
Synonyms:
Activated coagulation factor X (FXa) Coagulation factor X precursor F10 Factor X heavy chain Factor Xa Stuart-Prower factor
Type:
Enzyme
Mol. Mass.:
54726.60
Organism:
Homo sapiens (Human)
Description:
Residue:
488
  
Inhibitor
Name:
BDBM50594756
Synonyms:
CHEMBL5201486
Type:
Small organic molecule
Emp. Form.:
C23H22ClN5O2
Mol. Mass.:
435.906
SMILES:
CN(C(C)=N)c1ccc(cc1)C(=O)Nc1ccc(C)cc1C(=O)Nc1ccc(Cl)cn1
: