Target
Melanocortin receptor 5
Ligand
BDBM50168725
Substrate
Meas. Tech.
ChEMBL_306603 (CHEMBL832207)
IC50
40±n/a nM
Citation
 Bakshi, RKHong, QOlson, JTYe, ZSebhat, IKWeinberg, DHMacNeil, TKalyani, RNTang, RMartin, WJStrack, AMcGowan, ETamvakopoulos, CMiller, RRStearns, RATang, WMaclntyre, DEvan der Ploeg, LHPatchett, AANargund, RP 1-Amino-1,2,3,4-tetrahydronaphthalene-2-carboxylic acid as a Tic mimetic: application in the synthesis of potent human melanocortin-4 receptor selective agonists. Bioorg Med Chem Lett 15:3430-3 (2005)  
Target
Name:
Melanocortin receptor 5
Synonyms:
MC-2 MC5R Melanocortin MC5 Melanocortin receptor 5 | Melanocortin receptor 5 (MC5R)
Type:
Enzyme
Mol. Mass.:
36612.92
Organism:
Homo sapiens (Human)
Description:
P33032
Residue:
325
  
Inhibitor
Name:
BDBM50168725
Synonyms:
1-[2-[((R)-3-Amino-1,2,3,4-tetrahydro-naphthalene-2-carbonyl)-amino]-3-(4-chloro-phenyl)-propionyl]-4-cyclohexyl-piperidine-4-carboxylic acid tert-butylamide | CHEMBL362523
Type:
Small organic molecule
Emp. Form.:
C36H49ClN4O3
Mol. Mass.:
621.252
SMILES:
CC(C)(C)NC(=O)C1(CCN(CC1)C(=O)[C@@H](Cc1ccc(Cl)cc1)NC(=O)C1Cc2ccccc2CC1N)C1CCCCC1
: