Target
Dual specificity protein phosphatase 3
Ligand
BDBM50168897
Substrate
Meas. Tech.
ChEMBL_304945 (CHEMBL826974)
IC50
>200000±n/a nM
Citation
 Cutshall, NSO'Day, CPrezhdo, M Rhodanine derivatives as inhibitors of JSP-1. Bioorg Med Chem Lett 15:3374-9 (2005)  
Target
Name:
Dual specificity protein phosphatase 3
Synonyms:
DUS3_HUMAN Dual specificity protein phosphatase (VHR) Dual specificity protein phosphatase VHR Tyrosine-protein phosphatase non-receptor type 1 | VHR
Type:
Hydrolase
Mol. Mass.:
20480.58
Organism:
Homo sapiens (Human)
Description:
Residue:
185
  
Inhibitor
Name:
BDBM50168897
Synonyms:
3-{5-[1-(4-Methoxy-phenyl)-meth-(Z)-ylidene]-4-oxo-2-thioxo-thiazolidin-3-yl}-benzoic acid | CHEMBL183336
Type:
Small organic molecule
Emp. Form.:
C18H13NO4S2
Mol. Mass.:
371.43
SMILES:
COc1ccc(\C=C2/SC(=S)N(C2=O)c2cccc(c2)C(O)=O)cc1
: