Target
Lysine-specific demethylase 2B
Ligand
BDBM50525976
Substrate
Meas. Tech.
ChEMBL_2214828 (CHEMBL5127960)
IC50
8100±n/a nM
Citation
 He, XZhang, HZhang, YYe, YWang, SBai, RXie, TYe, XY Drug discovery of histone lysine demethylases (KDMs) inhibitors (progress from 2018 to present). Eur J Med Chem 231:0 (2022) Target
Name:
Lysine-specific demethylase 2B
Synonyms:
AA 1-650 FBL10 Homo sapiens lysine demethylase 2B (KDM2B) KDM2B Lysine-specific demethylase 2B NDY1 PCCX2
Type:
Enzyme Catalytic Domain
Mol. Mass.:
152658.35
Organism:
Homo sapiens (Human)
Description:
Q8NHM5
Residue:
1336
  
Inhibitor
Name:
BDBM50525976
Synonyms:
APO-066 CHEBI:68554 CP20 DN-18001AF Ferriprox L1 PL1
Type:
Small organic molecule
Emp. Form.:
C7H9NO2
Mol. Mass.:
139.1519
SMILES:
Cc1c(O)c(=O)ccn1C
: