Target
Lysine-specific demethylase 5C
Ligand
BDBM50525976
Substrate
Meas. Tech.
ChEMBL_2214829 (CHEMBL5127961)
IC50
5600±n/a nM
Citation
 He, XZhang, HZhang, YYe, YWang, SBai, RXie, TYe, XY Drug discovery of histone lysine demethylases (KDMs) inhibitors (progress from 2018 to present). Eur J Med Chem 231:0 (2022) Target
Name:
Lysine-specific demethylase 5C
Synonyms:
DXS1272E JARID1C KDM5C Lysine-specific demethylase 5C (KDM5C) Protein SmcX SMCX | XE169
Type:
PROTEIN
Mol. Mass.:
175691.17
Organism:
Homo sapiens (Human)
Description:
P41229
Residue:
1560
  
Inhibitor
Name:
BDBM50525976
Synonyms:
APO-066 CHEBI:68554 CP20 DN-18001AF Ferriprox L1 PL1
Type:
Small organic molecule
Emp. Form.:
C7H9NO2
Mol. Mass.:
139.1519
SMILES:
Cc1c(O)c(=O)ccn1C
: