Target
Lysine-specific demethylase 6A
Ligand
BDBM50525976
Substrate
Meas. Tech.
ChEMBL_2214830 (CHEMBL5127962)
IC50
4200±n/a nM
Citation
 He, XZhang, HZhang, YYe, YWang, SBai, RXie, TYe, XY Drug discovery of histone lysine demethylases (KDMs) inhibitors (progress from 2018 to present). Eur J Med Chem 231:0 (2022) Target
Name:
Lysine-specific demethylase 6A
Synonyms:
Histone demethylase UTX KDM6A_HUMAN Lysine-specific demethylase 6A (KDM6A(UTX)) UTX Ubiquitously-transcribed X chromosome tetratricopeptide repeat protein
Type:
Protein
Mol. Mass.:
154198.48
Organism:
Homo sapiens (Human)
Description:
O15550
Residue:
1401
  
Inhibitor
Name:
BDBM50525976
Synonyms:
APO-066 CHEBI:68554 CP20 DN-18001AF Ferriprox L1 PL1
Type:
Small organic molecule
Emp. Form.:
C7H9NO2
Mol. Mass.:
139.1519
SMILES:
Cc1c(O)c(=O)ccn1C
: