Target
Peroxisome proliferator-activated receptor gamma
Ligand
BDBM50169255
Substrate
Meas. Tech.
ChEMBL_306190 (CHEMBL830984)
IC50
>50000±n/a nM
Citation
 Shi, GQDropinski, JFMcKeever, BMXu, SBecker, JWBerger, JPMacNaul, KLElbrecht, AZhou, GDoebber, TWWang, PChao, YSForrest, MHeck, JVMoller, DEJones, AB Design and synthesis of alpha-aryloxyphenylacetic acid derivatives: a novel class of PPARalpha/gamma dual agonists with potent antihyperglycemic and lipid modulating activity. J Med Chem 48:4457-68 (2005)  
Target
Name:
Peroxisome proliferator-activated receptor gamma
Synonyms:
NR1C3 PPAR-gamma PPARG_HUMAN Peroxisome proliferator-activated receptor gamma (PPAR gamma) Peroxisome proliferator-activated receptor gamma (PPARĪ³) peroxisome proliferator-activated receptor gamma isoform 2
Type:
Nuclear Receptor
Mol. Mass.:
57613.46
Organism:
Homo sapiens (Human)
Description:
P37231
Residue:
505
  
Inhibitor
Name:
BDBM50169255
Synonyms:
(2,6-Di-sec-butyl-4-propionyl-phenoxy)-phenyl-acetic acid | CHEMBL371112
Type:
Small organic molecule
Emp. Form.:
C25H32O4
Mol. Mass.:
396.5192
SMILES:
CCC(C)c1cc(cc(C(C)CC)c1OC(C(O)=O)c1ccccc1)C(=O)CC
: