Target
Broad substrate specificity ATP-binding cassette transporter ABCG2
Ligand
BDBM13216
Substrate
Meas. Tech.
ChEMBL_2215580 (CHEMBL5128712)
IC50
2000±n/a nM
Citation
 Zattoni, IFDelabio, LCDutra, JPKita, DHScheiffer, GHembecker, MPereira, GDSMoure, VRValdameri, G Targeting breast cancer resistance protein (BCRP/ABCG2): Functional inhibitors and expression modulators. Eur J Med Chem 237:0 (2022) Target
Name:
Broad substrate specificity ATP-binding cassette transporter ABCG2
Synonyms:
ABCG2 ABCP ATP-binding cassette sub-family G member 2 ATP-binding cassette, sub-family G, member 2 BCRP1 CDw338 Mitoxantrone resistance-associated protein Urate exporter
Type:
Multi-pass membrane protein; monomer or homodimer; disulfide-linked
Mol. Mass.:
72329.48
Organism:
Homo sapiens (Human)
Description:
Q9UNQ0
Residue:
655
  
Inhibitor
Name:
BDBM13216
Synonyms:
BMS-354825 DASATINIB N-(2-chloro-6-methylphenyl)-2-({6-[4-(2-hydroxyethyl)piperazin-1-yl]-2-methylpyrimidin-4-yl}amino)-1,3-thiazole-5-carboxamide US20230348453, Compound A8 med.21724, Compound Dasatinib
Type:
Small organic molecule
Emp. Form.:
C22H26ClN7O2S
Mol. Mass.:
488.006
SMILES:
Cc1nc(Nc2ncc(s2)C(=O)Nc2c(C)cccc2Cl)cc(n1)N1CCN(CCO)CC1
: