Target
Methionine aminopeptidase
Ligand
BDBM50169681
Substrate
Meas. Tech.
ChEMBL_311781 (CHEMBL826403)
IC50
88.0±n/a nM
Citation
 Cui, YMHuang, QQXu, JChen, LLLi, JYYe, QZLi, JNan, FJ Identification of potent type I MetAP inhibitors by simple bioisosteric replacement. Part 1: Synthesis and preliminary SAR studies of thiazole-4-carboxylic acid thiazol-2-ylamide derivatives. Bioorg Med Chem Lett 15:3732-6 (2005)  
Target
Name:
Methionine aminopeptidase
Synonyms:
EcMetAP Methionine Aminopeptidase (MAP) Peptidase M | map
Type:
Enzyme
Mol. Mass.:
29326.96
Organism:
Escherichia coli (strain K12)
Description:
Full-length untagged EcMAP was expressed in E. coli.
Residue:
264
  
Inhibitor
Name:
BDBM50169681
Synonyms:
CHEMBL178736 | N-[4-(Thiazol-2-ylcarbamoyl)-thiazol-5-yl]-malonamic acid
Type:
Small organic molecule
Emp. Form.:
C10H8N4O4S2
Mol. Mass.:
312.325
SMILES:
OC(=O)CC(=O)Nc1scnc1C(=O)Nc1nccs1
: