Target
Transient receptor potential cation channel subfamily V member 1
Ligand
BDBM20315
Substrate
Meas. Tech.
ChEMBL_302712 (CHEMBL876782)
Ki
63±n/a nM
Citation
 Lee, JJin, MKKang, SUKim, SYLee, JShin, MHwang, JCho, SChoi, YSChoi, HKKim, SESuh, YGLee, YSKim, YHHa, HJToth, APearce, LVTran, RSzabo, TWelter, JDLundberg, DJWang, YLazar, JPavlyukovets, VAMorgan, MABlumberg, PM Analysis of structure-activity relationships for the 'B-region' of N-(4-t-butylbenzyl)-N'-[4-(methylsulfonylamino)benzyl]-thiourea analogues as TRPV1 antagonists. Bioorg Med Chem Lett 15:4143-50 (2005)  
Target
Name:
Transient receptor potential cation channel subfamily V member 1
Synonyms:
Capsaicin receptor TRPV1_RAT Trpv1 Vanilloid VR1 Vanilloid receptor 1 (VRI/TRPV1) Vanilloid receptor type 1-like (TrpV1/Vr1) Vr1l | osm-9-like TRP channel 1
Type:
Transient Receptor
Mol. Mass.:
94956.12
Organism:
Rattus norvegicus (rat)
Description:
O35433
Residue:
838
  
Inhibitor
Name:
BDBM20315
Synonyms:
3-[(4-tert-butylphenyl)methyl]-1-[(4-methanesulfonamidophenyl)methyl]thiourea KJM429 | thiourea analogue, 1
Type:
Small organic molecule
Emp. Form.:
C20H27N3O2S2
Mol. Mass.:
405.577
SMILES:
CC(C)(C)c1ccc(CNC(=S)NCc2ccc(NS(C)(=O)=O)cc2)cc1
: