Target
Adenosine receptor A2a
Ligand
BDBM82022
Substrate
Meas. Tech.
ChEMBL_2216592 (CHEMBL5129724)
Ki
76±n/a nM
Citation
 Shepherd, CRobinson, SBerizzi, AThompson, LEJBird, LCulurgioni, SVarzandeh, SRawlins, PBOlsen, RHJNavratilova, IH Surface Plasmon Resonance Screening to Identify Active and Selective Adenosine Receptor Binding Fragments. ACS Med Chem Lett 13:1172-1181 (2022) Target
Name:
Adenosine receptor A2a
Synonyms:
A2A adenosine receptor (hA2A) ADENOSINE A2 ADORA2 Adenosine A2A receptor (A2AAR)
Type:
G Protein-Coupled Receptor (GPCR)
Mol. Mass.:
44716.46
Organism:
Homo sapiens (Human)
Description:
P29274
Residue:
412
  
Inhibitor
Name:
BDBM82022
Synonyms:
2-(Phenylamino)ado (CV-1808) CHEMBL1256672 | N6-Phenylado
Type:
Emp. Form.:
C16H18N6O4
Mol. Mass.:
358.3519
SMILES:
Nc1nc(Nc2ccccc2)nc2n(cnc12)[C@@H]1O[C@H](CO)[C@@H](O)[C@H]1O
: