Target
Cannabinoid receptor 2
Ligand
BDBM50169953
Substrate
Meas. Tech.
ChEMBL_303211 (CHEMBL829836)
Ki
14±n/a nM
Citation
 Lu, DMeng, ZThakur, GAFan, PSteed, JTartal, CLHurst, DPReggio, PHDeschamps, JRParrish, DAGeorge, CJärbe, TULamb, RJMakriyannis, A Adamantyl cannabinoids: a novel class of cannabinergic ligands. J Med Chem 48:4576-85 (2005)  
Target
Name:
Cannabinoid receptor 2
Synonyms:
CANNABINOID CB2 CB2 Cannabinoid CB2 receptor Cannabinoid receptor 2 mCB2
Type:
Enzyme Catalytic Domain
Mol. Mass.:
38220.43
Organism:
MOUSE
Description:
P47936
Residue:
347
  
Inhibitor
Name:
BDBM50169953
Synonyms:
(6aR,10aR)-3-Adamantan-2-yl-6,6,9-trimethyl-6a,7,10,10a-tetrahydro-6H-benzo[c]chromen-1-ol CHEMBL371167
Type:
Small organic molecule
Emp. Form.:
C26H34O2
Mol. Mass.:
378.547
SMILES:
CC1=CC[C@@H]2[C@@H](C1)c1c(O)cc(cc1OC2(C)C)C1C2CC3CC(C2)CC1C3
: