Target
Adenosine receptor A2b
Ligand
BDBM50170137
Substrate
Meas. Tech.
ChEMBL_312875 (CHEMBL874953)
IC50
400±n/a nM
Citation
 Baraldi, PGPreti, DTabrizi, MAFruttarolo, FRomagnoli, RZaid, NAMoorman, ARMerighi, SVarani, KBorea, PA New pyrrolo[2,1-f]purine-2,4-dione and imidazo[2,1-f]purine-2,4-dione derivatives as potent and selective human A3 adenosine receptor antagonists. J Med Chem 48:4697-701 (2005)  
Target
Name:
Adenosine receptor A2b
Synonyms:
AA2BR_HUMAN ADORA2B Adenosine receptors A2b | Adenosine receptors; A2a & A2b
Type:
G Protein-Coupled Receptor (GPCR)
Mol. Mass.:
36341.22
Organism:
Homo sapiens (Human)
Description:
Residue:
332
  
Inhibitor
Name:
BDBM50170137
Synonyms:
1-Benzyl-7-methyl-3-propyl-1H,6H-pyrrolo[2,1-f]purine-2,4-dione CHEMBL189904
Type:
Small organic molecule
Emp. Form.:
C19H20N4O2
Mol. Mass.:
336.3877
SMILES:
CCCn1c(=O)n(Cc2ccccc2)c2nc3C=C(C)Cn3c2c1=O
: