Target
Aldo-keto reductase family 1 member C4
Ligand
BDBM50595592
Substrate
Meas. Tech.
ChEMBL_2217174 (CHEMBL5130306)
IC50
750±n/a nM
Citation
 He, SLiu, YChu, XLi, QLyu, WLiu, YXing, SFeng, FLiu, WGuo, QZhao, LSun, H Discovery of Novel Aldo-Keto Reductase 1C3 Inhibitors as Chemotherapeutic Potentiators for Cancer Drug Resistance. ACS Med Chem Lett 13:1286-1294 (2022) Target
Name:
Aldo-keto reductase family 1 member C4
Synonyms:
3-alpha-HSD1 3-alpha-hydroxysteroid dehydrogenase type I AKR1C4 Aldo-keto reductase family 1 member C4 (AK1C4) CHDR DD-4 Dihydrodiol dehydrogenase 4 | HAKRA
Type:
Enzyme
Mol. Mass.:
37068.40
Organism:
Homo sapiens (Human)
Description:
P17516
Residue:
323
  
Inhibitor
Name:
BDBM50595592
Synonyms:
CHEMBL5179823
Type:
Small organic molecule
Emp. Form.:
C20H23NO6
Mol. Mass.:
373.3997
SMILES:
CCOc1ccc2OCC(Cc2c1)C(=O)N(C)Cc1cc(C(O)=O)c(C)o1
: