Target
Melanin-concentrating hormone receptor 1
Ligand
BDBM50170620
Substrate
Meas. Tech.
ChEMBL_302876 (CHEMBL828790)
Ki
7.3±n/a nM
Citation
 Palani, AShapiro, SMcBriar, MDClader, JWGreenlee, WJSpar, BKowalski, TJFarley, CCook, Jvan Heek, MWeig, BO'neill, KGraziano, MHawes, B Biaryl ureas as potent and orally efficacious melanin concentrating hormone receptor 1 antagonists for the treatment of obesity. J Med Chem 48:4746-9 (2005)  
Target
Name:
Melanin-concentrating hormone receptor 1
Synonyms:
G-protein coupled receptor 24 MCH receptor 1 MCH-R1 MCHR-1 MCHR1_HUMAN Melanin-Concentrating Hormone Receptor 1 (MCH1R) Melanin-concentrating hormone receptor 1 (MCH-1) Melanin-concentrating hormone receptor 1 (MCHR-1) SLC-1 Somatostatin receptor-like protein
Type:
G Protein-Coupled Receptor (GPCR)
Mol. Mass.:
45976.27
Organism:
Homo sapiens (Human)
Description:
Membranes from CHO-K1 cells stably expressing human MCH1R were used in assays.
Residue:
422
  
Inhibitor
Name:
BDBM50170620
Synonyms:
1-(3'-Cyano-biphenyl-4-yl)-3-(3-fluoro-4-trifluoromethyl-phenyl)-1-[2-((S)-3-hydroxy-pyrrolidin-1-yl)-ethyl]-urea | CHEMBL187931
Type:
Small organic molecule
Emp. Form.:
C27H24F4N4O2
Mol. Mass.:
512.4987
SMILES:
O[C@H]1CCN(CCN(C(=O)Nc2ccc(c(F)c2)C(F)(F)F)c2ccc(cc2)-c2cccc(c2)C#N)C1
: