Target
Kappa-type opioid receptor
Ligand
BDBM50595853
Substrate
Meas. Tech.
ChEMBL_2218136 (CHEMBL5131268)
EC50
7.9±n/a nM
Citation
 Stefanucci, ADella Valle, AScioli, GMarinaccio, LPieretti, SMinosi, PSzucs, EBenyhe, SMasci, DTanguturi, PChou, KBarlow, DHouseknecht, KStreicher, JMMollica, A Discovery of ? Opioid Receptor (KOR)-Selective d-Tetrapeptides with Improved  ACS Med Chem Lett 13:1707-1714 (2022) Target
Name:
Kappa-type opioid receptor
Synonyms:
Kappa Opioid Receptor OPRK1 Opiate Kappa 1 | mu/kappa opioid receptor
Type:
G Protein-Coupled Receptor (GPCR)
Mol. Mass.:
42744.99
Organism:
Cavia porcellus (domestic guinea pig)
Description:
P41144
Residue:
380
  
Inhibitor
Name:
BDBM50595853
Synonyms:
CHEMBL5177451
Type:
Small organic molecule
Emp. Form.:
C31H44N8O4
Mol. Mass.:
592.7323
SMILES:
CCCC[C@@H](NC(=O)[C@H]1Cc2ccccc2CN1C(=O)[C@H](N)Cc1ccccc1)C(=O)N[C@H](CCCNC(N)=N)C(N)=O
: