Target
Sodium channel protein type 4 subunit alpha
Ligand
BDBM50595858
Substrate
Meas. Tech.
ChEMBL_2218159 (CHEMBL5131291)
IC50
51±n/a nM
Citation
 Pajouhesh, HDelwig, ABeckley, JTKlas, SMonteleone, DZhou, XLuu, GDu Bois, JHunter, JCMulcahy, JV Discovery of Selective Inhibitors of Na ACS Med Chem Lett 13:1763-1768 (2022) Target
Name:
Sodium channel protein type 4 subunit alpha
Synonyms:
SCN4A SkM1 Sodium channel protein skeletal muscle subunit alpha Sodium channel protein type IV alpha subunit Voltage-gated sodium channel subunit alpha Nav1.4 | Voltage-gated sodium channel subunit alpha Nav1.4 (Nav1.4)
Type:
Protein
Mol. Mass.:
208010.01
Organism:
Homo sapiens (Human)
Description:
P35499
Residue:
1836
  
Inhibitor
Name:
BDBM50595858
Synonyms:
CHEMBL5204844
Type:
Small organic molecule
Emp. Form.:
C17H19F3N6O5
Mol. Mass.:
444.3652
SMILES:
[H][C@@]12NC(=N)N[C@]11N(C[C@H](OC(=O)c3ccccc3C(F)(F)F)C1(O)O)C(=N)N[C@H]2CO
: