Target
Sodium channel protein type 4 subunit alpha
Ligand
BDBM50595862
Substrate
Meas. Tech.
ChEMBL_2218159 (CHEMBL5131291)
IC50
2.0±n/a nM
Citation
 Pajouhesh, HDelwig, ABeckley, JTKlas, SMonteleone, DZhou, XLuu, GDu Bois, JHunter, JCMulcahy, JV Discovery of Selective Inhibitors of Na ACS Med Chem Lett 13:1763-1768 (2022) Target
Name:
Sodium channel protein type 4 subunit alpha
Synonyms:
SCN4A SkM1 Sodium channel protein skeletal muscle subunit alpha Sodium channel protein type IV alpha subunit Voltage-gated sodium channel subunit alpha Nav1.4 | Voltage-gated sodium channel subunit alpha Nav1.4 (Nav1.4)
Type:
Protein
Mol. Mass.:
208010.01
Organism:
Homo sapiens (Human)
Description:
P35499
Residue:
1836
  
Inhibitor
Name:
BDBM50595862
Synonyms:
CHEMBL5189924
Type:
Small organic molecule
Emp. Form.:
C18H19F6N7O4
Mol. Mass.:
511.3784
SMILES:
[H][C@@]12NC(=N)N[C@]11N(C[C@H](NC(=O)c3cc(ccc3C(F)(F)F)C(F)(F)F)C1(O)O)C(=N)N[C@H]2CO
: